problem cross compiling ruby 1.9

Discussion in 'Ruby' started by Emanuele Ricci, May 7, 2008.

  1. Hi,I get the following error on make cross compiling ruby for an arm
    processor:

    /Desktop/ruby-1.9.0-0# make
    /lib/fileutils.rb:1532:in `public': undefined method `commands' for
    class `Module' (NameError)
    from ./lib/fileutils.rb:1532
    from ./lib/fileutils.rb:1531:in `each'
    from ./lib/fileutils.rb:1531
    from ./mkconfig.rb:10:in `require'
    from ./mkconfig.rb:10
    make: *** [.rbconfig.time] Error 1


    Any clues?
    --
    Posted via http://www.ruby-forum.com/.
    Emanuele Ricci, May 7, 2008
    #1
    1. Advertising

  2. And what about this?

    cont.c: In function `cont_restore_0':
    cont.c:327: error: structure has no member named `machine_stack_src'
    make: *** [cont.o] Error 1
    --
    Posted via http://www.ruby-forum.com/.
    Emanuele Ricci, May 7, 2008
    #2
    1. Advertising

Want to reply to this thread or ask your own question?

It takes just 2 minutes to sign up (and it's free!). Just click the sign up button to choose a username and then you can ask your own questions on the forum.
Similar Threads
  1. Garrett Cooper
    Replies:
    0
    Views:
    541
    Garrett Cooper
    Feb 24, 2009
  2. Garrett Cooper
    Replies:
    0
    Views:
    485
    Garrett Cooper
    Feb 24, 2009
  3. Dan Hinz

    cross-compiling ruby

    Dan Hinz, Sep 28, 2005, in forum: Ruby
    Replies:
    2
    Views:
    132
  4. Kero

    cross compiling Ruby

    Kero, Oct 9, 2005, in forum: Ruby
    Replies:
    0
    Views:
    135
  5. gregarican

    Cross-compiling Ruby for ARM?

    gregarican, Nov 7, 2005, in forum: Ruby
    Replies:
    0
    Views:
    185
    gregarican
    Nov 7, 2005
Loading...

Share This Page