scons Buffer.cpp

Discussion in 'Python' started by brnstrmrs, Mar 13, 2008.

  1. brnstrmrs

    brnstrmrs Guest

    I am trying to install some libs but can not get them build properly.
    It seems to be looking for Buffer.cpp but can't find it any where .
    Here is the error message:
    scons: Reading SConscript files ...
    scons: done reading SConscript files.
    scons: Building targets ...
    g++ -o AssociationRejection.o -c -I/usr/lib -I/usr/lib/boost
    AssociationRejection.cpp
    g++ -o Buffer.o -c -I/usr/lib -I/usr/lib/boost Buffer.cpp
    In file included from Buffer.cpp:1:
    Buffer.hpp:9:27: error: socket/Base.hpp: No such file or directory
    Buffer.hpp:10:35: error: socket/SwitchEndian.hpp: No such file or
    directory
    Buffer.hpp: In member function 'dicom::Buffer&
    dicom::Buffer::eek:perator<<(T)':
    Buffer.hpp:84: error: 'is_fundamental' is not a member of 'boost'
    Buffer.hpp:84: error: '::value' has not been declared
    Buffer.hpp:90: error: template argument 1 is invalid
    Buffer.hpp:95: error: template argument 1 is invalid
    Buffer.hpp:96: error: expected unqualified-id before '}' token
    Buffer.hpp: In member function 'dicom::Buffer&
    dicom::Buffer::eek:perator>>(T&)':
    Buffer.hpp:103: error: 'is_const' is not a member of 'boost'
    Buffer.hpp:103: error: '::value' has not been declared
    Buffer.hpp:104: error: template argument 1 is invalid
    Buffer.hpp:105: error: template argument 1 is invalid
    Buffer.hpp:105: error: invalid type in declaration before ';' token
    Buffer.hpp:105: error: declaration of 'typedef int& data' shadows a
    parameter
    Buffer.hpp:109: error: 'pdata' was not declared in this scope
    Buffer.hpp:117: error: expected unqualified-id before '=' token
    Buffer.cpp: In member function 'dicom::Buffer&
    dicom::Buffer::eek:perator>>(std::vector<short unsigned int,
    std::allocator<short unsigned int> >&)':
    Buffer.cpp:38: error: 'SwitchVectorEndian' was not declared in this
    scope
    Buffer.cpp: In member function 'void dicom::Buffer::AddVector(const
    std::vector<short unsigned int, std::allocator<short unsigned int>
    >&)':

    Buffer.cpp:112: error: 'SwitchVectorEndian' was not declared in this
    scope
    Buffer.hpp: In member function 'dicom::Buffer&
    dicom::Buffer::eek:perator>>(T&) [with T = char]':
    Buffer.cpp:51: instantiated from here
    Buffer.hpp:105: error: declaration of 'typedef int& data' shadows a
    parameter
    Buffer.hpp: In member function 'dicom::Buffer&
    dicom::Buffer::eek:perator>>(T&) [with T = UINT16]':
    Buffer.cpp:59: instantiated from here
    Buffer.hpp:105: error: declaration of 'typedef int& data' shadows a
    parameter
    scons: *** [Buffer.o] Error 1
    scons: building terminated because of errors.
     
    brnstrmrs, Mar 13, 2008
    #1
    1. Advertising

Want to reply to this thread or ask your own question?

It takes just 2 minutes to sign up (and it's free!). Just click the sign up button to choose a username and then you can ask your own questions on the forum.
Similar Threads
  1. DrUg13
    Replies:
    1
    Views:
    487
    DrUg13
    Feb 10, 2004
  2. Alex Vinokur
    Replies:
    7
    Views:
    417
    Greg Comeau
    Nov 15, 2004
  3. Lothar Werzinger
    Replies:
    1
    Views:
    514
    fuzzylollipop
    Dec 27, 2004
  4. Vinu
    Replies:
    9
    Views:
    645
  5. www.hitechskill.com
    Replies:
    0
    Views:
    1,372
    www.hitechskill.com
    Apr 9, 2006
Loading...

Share This Page